{"text_format":"1","workbook":"xlsx","n_sheets":11,"sheets":["Payment info","Lunches","CAT; A","CAT; B","CAT; M","Relay AB","CAT; C","CAT; D","Relay CD","Transfer","Parameters"],"not_rendered":{"charts":0,"images":0,"macros":1,"external_links":0,"defined_names":0,"comments":0,"pivot_tables":0},"unopened":[],"bounds":{"document_bytes":16777216,"sheet_cells":100000,"rows_first":2000,"rows_last":500,"rows_between":2000,"halvings":0,"cell_chars":16384,"cell_head_chars":4096},"cells_cut":0,"cells_raw":0,"read":"whole","date_system":"1900"}

{"sheet":"Payment info","index":0,"n_rows":14,"n_cols":6,"rows_kept":14,"cut":false,"hidden":false,"merged":[]}
[{"$f":"\"Payment information for: \"&'CAT; A'!C4","v":"Payment information for: "},null,null,null," ",{"$f":"\"Payment has to be transferred before the \"&Parameters!B3&\" \"&Parameters!B1&\" to:\"","v":"Payment has to be transferred before the 20th of June 2024 to:"}]
[]
["Total Cost","Sum of starts\n Athletes","Sum of starts\nTeams","Total",null,"Stichting Stadstriathlon Weert"]
["Cat. A-B-M",{"$f":"'CAT; A'!E34+'CAT; B'!E34+'CAT; M'!E34","v":0},{"$f":"'Relay AB'!D38+'Relay AB'!D67","v":0},{"$f":"(B4*B11)+(C4*B12)","v":0},null,"IBAN: NL02 RABO 0300680619"]
["Cat C-D/E",{"$f":"'CAT; C'!E34+'CAT; D'!E34","v":0},{"$f":"'Relay CD'!D38+'Relay CD'!D67","v":0},{"$f":"(B13*B5)+(B14*C5)","v":0},null,{"$f":"\"with remark: COW\"&RIGHT(Parameters!B1,2)&\" + \"&'CAT; A'!C4","v":"with remark: COW24 + "}]
["Lunches",null,null,{"$f":"Lunches!B22","v":0}]
[]
[null,null,"Total cost",{"$f":"SUM(D4:D7)","v":0}]
[]
["Registration fee","Price"]
["Athletes A-B-M per start",5]
["Teams A-B-M per start",5]
["Athletes C-D/E per start",4]
["Teams C-D/E per start",4]

{"sheet":"Lunches","index":1,"n_rows":24,"n_cols":6,"rows_kept":24,"cut":false,"hidden":false,"merged":[]}
[{"$f":"\"COW \"&Parameters!B1&\" Lunch order form for \"&'CAT; A'!C4","v":"COW 2024 Lunch order form for "}]
["Last entry:",{"$f":"Parameters!B2","v":"16th of June"}]
[]
[null,"Healty","Healty Vegan","Ham/Cheese","Salmon"]
["Price of sandwich 20 cm",5,5,5,6]
[null,"Sandwich 1","Sandwich 2","Sandwich 3","Sandwich 4","Total"]
["Sandwiches Saturday",null,null,null,null,{"$f":"SUM(B7:E7)","v":0}]
["Sandwiches Sunday",null,null,null,null,{"$f":"SUM(B8:E8)","v":0}]
[]
["Subtotal 20cm sandwich",{"$f":"SUM(B7:B8)","v":0},{"$f":"SUM(C7:C8)","v":0},0,0]
["Subtotal:",{"$f":"B5*B10","v":0},{"$f":"C5*C10","v":0},0,0,{"$f":"SUM(B11:E11)","v":0}]
[]
[null,"Healty","Healty Vegan","Ham/Cheese","Salmon"]
["Price of sandwich 30 cm",6.5,6.5,6.5,7.5]
[null,"Sandwich 1","Sandwich 2","Sandwich 3","Sandwich 4","Total"]
["Sandwiches Saturday",null,null,null,null,{"$f":"SUM(B16:E16)","v":0}]
["Sandwiches Sunday",null,null,null,null,{"$f":"SUM(B17:E17)","v":0}]
[]
["Subtotal 30cm sandwich",{"$f":"SUM(B16:B17)","v":0},{"$f":"SUM(C16:C17)","v":0},0,0," "]
[null,{"$f":"B14*B19","v":0},{"$f":"C14*C19","v":0},{"$f":"D14*D19","v":0},{"$f":"E14*E19","v":0},{"$f":"SUM(B20:E20)","v":0}]
{"$rows_left_out":5}
{"sheet":"CAT; A","index":2,"n_rows":47,"n_cols":10,"rows_kept":47,"cut":false,"hidden":false,"merged":[[8,2,8,7],[9,2,9,7],[2,2,2,7],[3,2,3,7],[4,2,4,7],[5,2,5,7],[6,2,6,7],[7,2,7,7]]}
[{"$f":"\"COW \"&Parameters!B1&\" Entry form competition: CAT: A: year of birth \"&Parameters!B10&\" and earlier\"","v":"COW 2024 Entry form competition: CAT: A: year of birth 2005 and earlier"}]
[null,"Last entry:",{"$f":"Parameters!$B$2","v":"16th of June"}]
[null,"Team-number:"]
[null,"Team-name:"]
[null,"Country:"]
[null,"Team-manager:"]
[null,"e-mail:"]
[null,"Phone:"]
[null,"Address:"]
[null,"ZipCode / Town:"]
["Female",null,null,null,"Number of individual \nstarts","Surf Race","Board Race","Ski race","Ocean(wo)man","2 km City Ocean Run"]
["Team + nr","Surname","Given name","Year of birth",null,1,2,3,4,5]
[null,null,null,"YYYY"]
[{"$f":"$C$3&\"-01\"","v":"-01"},null,null,null,{"$f":"SUM(F14:J14)","v":0},0,0,0,0,0]
[{"$f":"$C$3&\"-02\"","v":"-02"},null,null,null,{"$f":"SUM(F15:J15)","v":0},0,0,0,0,0]
[{"$f":"$C$3&\"-03\"","v":"-03"},null,null,null,0,0,0,0,0,0]
[{"$f":"$C$3&\"-04\"","v":"-04"},null,null,null,0,0,0,0,0,0]
[{"$f":"$C$3&\"-05\"","v":"-05"},null,null,null,0,0,0,0,0,0]
[{"$f":"$C$3&\"-06\"","v":"-06"},null,null,null,0,0,0,0,0,0]
[]
{"$rows_left_out":28}
{"sheet":"CAT; B","index":3,"n_rows":39,"n_cols":10,"rows_kept":39,"cut":false,"hidden":false,"merged":[[7,2,7,7],[8,2,8,7],[9,2,9,7],[2,2,2,7],[3,2,3,7],[4,2,4,7],[5,2,5,7],[6,2,6,7]]}
[{"$f":"\"COW \"&Parameters!B1&\" Entry form competition: CAT: B: year of birth \"&Parameters!B9&\" up to and incl. \"&Parameters!B8","v":"COW 2024 Entry form competition: CAT: B: year of birth 2006 up to and incl. 2009"}]
[null,"Last entry:",{"$f":"Parameters!$B$2","v":"16th of June"}]
[null,{"$f":"'CAT; A'!B3","v":"Team-number:"}]
[null,{"$f":"'CAT; A'!B4","v":"Team-name:"},{"$f":"IF('CAT; A'!C4=\"\",\"\",'CAT; A'!C4)","v":""}]
[null,{"$f":"'CAT; A'!B5","v":"Country:"},{"$f":"IF('CAT; A'!C5=\"\",\"\",'CAT; A'!C5)","v":""}]
[null,{"$f":"'CAT; A'!B6","v":"Team-manager:"},{"$f":"IF('CAT; A'!C6=\"\",\"\",'CAT; A'!C6)","v":""}]
[null,{"$f":"'CAT; A'!B7","v":"e-mail:"},{"$f":"IF('CAT; A'!C7=\"\",\"\",'CAT; A'!C7)","v":""}]
[null,{"$f":"'CAT; A'!B8","v":"Phone:"},{"$f":"IF('CAT; A'!C8=\"\",\"\",'CAT; A'!C8)","v":""}]
[null,{"$f":"'CAT; A'!B9","v":"Address:"},{"$f":"IF('CAT; A'!C9=\"\",\"\",'CAT; A'!C9)","v":""}]
[null,{"$f":"'CAT; A'!B10","v":"ZipCode / Town:"},{"$f":"IF('CAT; A'!C10=\"\",\"\",'CAT; A'!C10)","v":""}]
["Female",null,null,null,"Number of individual \nstarts",{"$f":"'CAT; A'!F11","v":"Surf Race"},{"$f":"'CAT; A'!G11","v":"Board Race"},{"$f":"'CAT; A'!H11","v":"Ski race"},{"$f":"'CAT; A'!I11","v":"Ocean(wo)man"},{"$f":"'CAT; A'!J11","v":"2 km City Ocean Run"}]
["Team + nr","Surname","Given name","Year of birth",null,1,2,3,4,5]
[null,null,null,"YYYY"]
[{"$f":"$C$3&\"-01\"","v":"-01"},null,null,null,{"$f":"SUM(F14:J14)","v":0},0,0,0,0,0]
[{"$f":"$C$3&\"-02\"","v":"-02"},null,null,null,{"$f":"SUM(F15:J15)","v":0},0,0,0,0,0]
[{"$f":"$C$3&\"-03\"","v":"-03"},null,null,null,0,0,0,0,0,0]
[{"$f":"$C$3&\"-04\"","v":"-04"},null,null,null,0,0,0,0,0,0]
[{"$f":"$C$3&\"-05\"","v":"-05"},null,null,null,0,0,0,0,0,0]
[{"$f":"$C$3&\"-06\"","v":"-06"},null,null,null,0,0,0,0,0,0]
[]
{"$rows_left_out":20}
{"sheet":"CAT; M","index":4,"n_rows":39,"n_cols":10,"rows_kept":39,"cut":false,"hidden":false,"merged":[[7,2,7,7],[8,2,8,7],[9,2,9,7],[2,2,2,7],[3,2,3,7],[4,2,4,7],[5,2,5,7],[6,2,6,7]]}
[{"$f":"\"COW \"&Parameters!B1&\" Entry form competition: CAT: M: year of birth \"&Parameters!B11&\" and earlier\"","v":"COW 2024 Entry form competition: CAT: M: year of birth 1994 and earlier"}]
[null,"Last entry:",{"$f":"Parameters!$B$2","v":"16th of June"}]
[null,{"$f":"'CAT; A'!B3","v":"Team-number:"}]
[null,{"$f":"'CAT; A'!B4","v":"Team-name:"},{"$f":"IF('CAT; A'!C4=\"\",\"\",'CAT; A'!C4)","v":""}]
[null,{"$f":"'CAT; A'!B5","v":"Country:"},{"$f":"IF('CAT; A'!C5=\"\",\"\",'CAT; A'!C5)","v":""}]
[null,{"$f":"'CAT; A'!B6","v":"Team-manager:"},{"$f":"IF('CAT; A'!C6=\"\",\"\",'CAT; A'!C6)","v":""}]
[null,{"$f":"'CAT; A'!B7","v":"e-mail:"},{"$f":"IF('CAT; A'!C7=\"\",\"\",'CAT; A'!C7)","v":""}]
[null,{"$f":"'CAT; A'!B8","v":"Phone:"},{"$f":"IF('CAT; A'!C8=\"\",\"\",'CAT; A'!C8)","v":""}]
[null,{"$f":"'CAT; A'!B9","v":"Address:"},{"$f":"IF('CAT; A'!C9=\"\",\"\",'CAT; A'!C9)","v":""}]
[null,{"$f":"'CAT; A'!B10","v":"ZipCode / Town:"},{"$f":"IF('CAT; A'!C10=\"\",\"\",'CAT; A'!C10)","v":""}]
["Female",null,null,null,"Number of individual \nstarts",{"$f":"'CAT; A'!F11","v":"Surf Race"},{"$f":"'CAT; A'!G11","v":"Board Race"},{"$f":"'CAT; A'!H11","v":"Ski race"},{"$f":"'CAT; A'!I11","v":"Ocean(wo)man"},{"$f":"'CAT; A'!J11","v":"2 km City Ocean Run"}]
["Team + nr","Surname","Given name","Year of birth",null,1,2,3,4,5]
[null,null,null,"YYYY"]
[{"$f":"$C$3&\"-01\"","v":"-01"},null,null,null,{"$f":"SUM(F14:J14)","v":0},0,0,0,0,0]
[{"$f":"$C$3&\"-02\"","v":"-02"},null,null,null,{"$f":"SUM(F15:J15)","v":0},0,0,0,0,0]
[{"$f":"$C$3&\"-03\"","v":"-03"},null,null,null,0,0,0,0,0,0]
[{"$f":"$C$3&\"-04\"","v":"-04"},null,null,null,0,0,0,0,0,0]
[{"$f":"$C$3&\"-05\"","v":"-05"},null,null,null,0,0,0,0,0,0]
[{"$f":"$C$3&\"-06\"","v":"-06"},null,null,null,0,0,0,0,0,0]
[]
{"$rows_left_out":20}
{"sheet":"Relay AB","index":5,"n_rows":80,"n_cols":10,"rows_kept":80,"cut":false,"hidden":false,"merged":[[8,2,8,7],[9,2,9,7],[2,2,2,7],[3,2,3,7],[4,2,4,7],[5,2,5,7],[6,2,6,7],[7,2,7,7]]}
[{"$f":"\"COW \"&Parameters!B1&\" Entry form competition: Relay AB ( -\"&Parameters!B10&\"/ \"&Parameters!B9&\"-\"&Parameters!B8&\")\"","v":"COW 2024 Entry form competition: Relay AB ( -2005/ 2006-2009)"}]
[null,"Last entry:",{"$f":"Parameters!$B$2","v":"16th of June"}]
[null,"Team-number:",{"$f":"\"A: \"&'CAT; A'!C3&\" | B: \"&'CAT; B'!C3","v":"A:  | B: "}]
[null,"Team-name:",{"$f":"IF('CAT; A'!C4=\"\",\"\",'CAT; A'!C4)","v":""}]
[null,"Country:",{"$f":"IF('CAT; A'!C5=\"\",\"\",'CAT; A'!C5)","v":""}]
[null,"Team-manager:",{"$f":"IF('CAT; A'!C6=\"\",\"\",'CAT; A'!C6)","v":""}]
[null,"e-mail:",{"$f":"IF('CAT; A'!C7=\"\",\"\",'CAT; A'!C7)","v":""}]
[null,"Phone:",{"$f":"IF('CAT; A'!C8=\"\",\"\",'CAT; A'!C8)","v":""}]
[null,"Address:",{"$f":"IF('CAT; A'!C9=\"\",\"\",'CAT; A'!C9)","v":""}]
[null,"ZipCode / Town:",{"$f":"IF('CAT; A'!C10=\"\",\"\",'CAT; A'!C10)","v":""}]
["Female",null,null,"Number of team starts","Board Rescue Race\n(2 participants)","Rescue Tube Rescue Race\n(4 participants)","Mixed Oceanman\n(2 male + 2 female)","Swim Teams \n(3 participants)"]
["Category","Team-nr + Relay-nr","Brigade-name"]
[{"$f":"\"A-\"&A11","v":"A-Female"}]
[{"$f":"\"Relay \"&$A$13","v":"Relay A-Female"},{"$f":"LEFT($A$13,3)&\"-\"&'CAT; A'!$C$3&\"-01\"","v":"A-F--01"},{"$f":"$C$4","v":""},{"$f":"SUM(E14:H14)","v":0},0,0,null,0]
["Relay A-Female",{"$f":"LEFT($A$13,3)&\"-\"&'CAT; A'!$C$3&\"-02\"","v":"A-F--02"},{"$f":"IF(SUM(E15:H15)>0,$C$4,\"\")","v":""},0,0,0,null,0]
["Relay A-Female",{"$f":"LEFT($A$13,3)&\"-\"&'CAT; A'!$C$3&\"-03\"","v":"A-F--03"},"",0,0,0,null,0]
["Relay A-Female",{"$f":"LEFT($A$13,3)&\"-\"&'CAT; A'!$C$3&\"-04\"","v":"A-F--04"},"",0,0,0,null,0]
["Relay A-Female",{"$f":"LEFT($A$13,3)&\"-\"&'CAT; A'!$C$3&\"-05\"","v":"A-F--05"},"",0,0,0,null,0]
["Relay A-Female",{"$f":"LEFT($A$13,3)&\"-\"&'CAT; A'!$C$3&\"-06\"","v":"A-F--06"},"",0,0,0,null,0]
["Relay A-Female",{"$f":"LEFT($A$13,3)&\"-\"&'CAT; A'!$C$3&\"-07\"","v":"A-F--07"},"",0,0,0,null,0]
{"$rows_left_out":61}
{"sheet":"CAT; C","index":6,"n_rows":39,"n_cols":9,"rows_kept":39,"cut":false,"hidden":false,"merged":[[7,2,7,7],[8,2,8,7],[9,2,9,7],[2,2,2,7],[3,2,3,7],[4,2,4,7],[5,2,5,7],[6,2,6,7]]}
[{"$f":"\"COW \"&Parameters!$B$1&\" Entry form competition: CAT: C: year of birth \"&Parameters!$B$7&\" up to and incl. \"&Parameters!$B$6","v":"COW 2024 Entry form competition: CAT: C: year of birth 2010 up to and incl. 2012"}]
[null,"Last entry:",{"$f":"Parameters!$B$2","v":"16th of June"}]
[null,{"$f":"'CAT; A'!B3","v":"Team-number:"}]
[null,{"$f":"'CAT; A'!B4","v":"Team-name:"},{"$f":"IF('CAT; A'!C4=\"\",\"\",'CAT; A'!C4)","v":""}]
[null,{"$f":"'CAT; A'!B5","v":"Country:"},{"$f":"IF('CAT; A'!C5=\"\",\"\",'CAT; A'!C5)","v":""}]
[null,{"$f":"'CAT; A'!B6","v":"Team-manager:"},{"$f":"IF('CAT; A'!C6=\"\",\"\",'CAT; A'!C6)","v":""}]
[null,{"$f":"'CAT; A'!B7","v":"e-mail:"},{"$f":"IF('CAT; A'!C7=\"\",\"\",'CAT; A'!C7)","v":""}]
[null,{"$f":"'CAT; A'!B8","v":"Phone:"},{"$f":"IF('CAT; A'!C8=\"\",\"\",'CAT; A'!C8)","v":""}]
[null,{"$f":"'CAT; A'!B9","v":"Address:"},{"$f":"IF('CAT; A'!C9=\"\",\"\",'CAT; A'!C9)","v":""}]
[null,{"$f":"'CAT; A'!B10","v":"ZipCode / Town:"},{"$f":"IF('CAT; A'!C10=\"\",\"\",'CAT; A'!C10)","v":""}]
["Female",null,null,null,{"$f":"'CAT; A'!E11","v":"Number of individual \nstarts"},"Board Race","Run-Swim-Run","Ocean(wo)man R-S-B","750 m City Ocean Run"]
["Team + nr","Surname","Given name","Year of birth",null,1,2,3,4]
[null,null,null,"YYYY"]
[{"$f":"$C$3&\"-01\"","v":"-01"},null,null,null,{"$f":"SUM(F14:I14)","v":0},0,0,0,0]
[{"$f":"$C$3&\"-02\"","v":"-02"},null,null,null,0,0,0,0,0]
[{"$f":"$C$3&\"-03\"","v":"-03"},null,null,null,0,0,0,0,0]
[{"$f":"$C$3&\"-04\"","v":"-04"},null,null,null,0,0,0,0,0]
[{"$f":"$C$3&\"-05\"","v":"-05"},null,null,null,0,0,0,0,0]
[{"$f":"$C$3&\"-06\"","v":"-06"},null,null,null,0,0,0,0,0]
[]
{"$rows_left_out":20}
{"sheet":"CAT; D","index":7,"n_rows":39,"n_cols":9,"rows_kept":39,"cut":false,"hidden":false,"merged":[[7,2,7,7],[8,2,8,7],[9,2,9,7],[2,2,2,7],[3,2,3,7],[4,2,4,7],[5,2,5,7],[6,2,6,7]]}
[{"$f":"\"COW \"&Parameters!$B$1&\" Entry form competition: CAT: D: year of birth \"&Parameters!$B$5&\" up to and incl. \"&Parameters!$B$4","v":"COW 2024 Entry form competition: CAT: D: year of birth 2013 up to and incl. 2017"}]
[null,"Last entry:",{"$f":"Parameters!$B$2","v":"16th of June"}]
[null,{"$f":"'CAT; A'!B3","v":"Team-number:"}]
[null,{"$f":"'CAT; A'!B4","v":"Team-name:"},{"$f":"IF('CAT; C'!C4=\"\",\"\",'CAT; C'!C4)","v":""}]
[null,{"$f":"'CAT; A'!B5","v":"Country:"},{"$f":"IF('CAT; C'!C5=\"\",\"\",'CAT; C'!C5)","v":""}]
[null,{"$f":"'CAT; A'!B6","v":"Team-manager:"},{"$f":"IF('CAT; C'!C6=\"\",\"\",'CAT; C'!C6)","v":""}]
[null,{"$f":"'CAT; A'!B7","v":"e-mail:"},{"$f":"IF('CAT; C'!C7=\"\",\"\",'CAT; C'!C7)","v":""}]
[null,{"$f":"'CAT; A'!B8","v":"Phone:"},{"$f":"IF('CAT; C'!C8=\"\",\"\",'CAT; C'!C8)","v":""}]
[null,{"$f":"'CAT; A'!B9","v":"Address:"},{"$f":"IF('CAT; C'!C9=\"\",\"\",'CAT; C'!C9)","v":""}]
[null,{"$f":"'CAT; A'!B10","v":"ZipCode / Town:"},{"$f":"IF('CAT; C'!C10=\"\",\"\",'CAT; C'!C10)","v":""}]
["Female",null,null,null,{"$f":"'CAT; A'!E11","v":"Number of individual \nstarts"},{"$f":"'CAT; C'!F11","v":"Board Race"},{"$f":"'CAT; C'!G11","v":"Run-Swim-Run"},{"$f":"'CAT; C'!H11","v":"Ocean(wo)man R-S-B"},{"$f":"'CAT; C'!I11","v":"750 m City Ocean Run"}]
["Team + nr","Surname","Given name","Year of birth",null,1,2,3,4]
[null,null,null,"YYYY"]
[{"$f":"$C$3&\"-01\"","v":"-01"},null,null,null,{"$f":"SUM(F14:I14)","v":0},0,0,0,0]
[{"$f":"$C$3&\"-02\"","v":"-02"},null,null,null,0,0,0,0,0]
[{"$f":"$C$3&\"-03\"","v":"-03"},null,null,null,0,0,0,0,0]
[{"$f":"$C$3&\"-04\"","v":"-04"},null,null,null,0,0,0,0,0]
[{"$f":"$C$3&\"-05\"","v":"-05"},null,null,null,0,0,0,0,0]
[{"$f":"$C$3&\"-06\"","v":"-06"},null,null,null,0,0,0,0,0]
[]
{"$rows_left_out":20}
{"sheet":"Relay CD","index":8,"n_rows":80,"n_cols":6,"rows_kept":80,"cut":false,"hidden":false,"merged":[[8,2,8,7],[9,2,9,7],[2,2,2,7],[3,2,3,7],[4,2,4,7],[5,2,5,7],[6,2,6,7],[7,2,7,7]]}
[{"$f":"\"COW \"&Parameters!$B$1&\" Entry form competition: Relay CD (\"&Parameters!$B$7&\"-\"&Parameters!$B$6&\" / \"&Parameters!$B$5&\"-\"&Parameters!$B$4&\")\"","v":"COW 2024 Entry form competition: Relay CD (2010-2012 / 2013-2017)"}]
[null,"Last entry:",{"$f":"Parameters!$B$2","v":"16th of June"}]
[null,"Team-number:",{"$f":"\"C: \"&'CAT; C'!C3&\" | D: \"&'CAT; D'!C3","v":"C:  | D: "}]
[null,"Team-name:",{"$f":"IF('CAT; C'!C4=\"\",\"\",'CAT; C'!C4)","v":""}]
[null,"Country:",{"$f":"IF('CAT; C'!C5=\"\",\"\",'CAT; C'!C5)","v":""}]
[null,"Team-manager:",{"$f":"IF('CAT; C'!C6=\"\",\"\",'CAT; C'!C6)","v":""}]
[null,"e-mail:",{"$f":"IF('CAT; C'!C7=\"\",\"\",'CAT; C'!C7)","v":""}]
[null,"Phone:",{"$f":"IF('CAT; C'!C8=\"\",\"\",'CAT; C'!C8)","v":""}]
[null,"Address:",{"$f":"IF('CAT; C'!C9=\"\",\"\",'CAT; C'!C9)","v":""}]
[null,"ZipCode / Town:",{"$f":"IF('CAT; C'!C10=\"\",\"\",'CAT; C'!C10)","v":""}]
["Female",null,null,"Number of team starts","Board Rescue Race\n(2 participants)","Camaron Relay\n(4 participants)"]
["Category","Team-nr + Relay-nr","Brigade-name",null,6,7]
[{"$f":"\"C-\"&A11","v":"C-Female"}]
[{"$f":"\"Relay \"&$A$13","v":"Relay C-Female"},{"$f":"LEFT($A$13,3)&\"-\"&'CAT; C'!$C$3&\"-01\"","v":"C-F--01"},{"$f":"$C$4","v":""},{"$f":"SUM(E14:F14)","v":0},0,0]
["Relay C-Female",{"$f":"LEFT($A$13,3)&\"-\"&'CAT; C'!$C$3&\"-02\"","v":"C-F--02"},{"$f":"IF(SUM(E15:F15)>0,$C$4,\"\")","v":""},0,0,0]
["Relay C-Female",{"$f":"LEFT($A$13,3)&\"-\"&'CAT; C'!$C$3&\"-03\"","v":"C-F--03"},"",0,0,0]
["Relay C-Female",{"$f":"LEFT($A$13,3)&\"-\"&'CAT; C'!$C$3&\"-04\"","v":"C-F--04"},"",0,0,0]
["Relay C-Female",{"$f":"LEFT($A$13,3)&\"-\"&'CAT; C'!$C$3&\"-05\"","v":"C-F--05"},"",0,0,0]
["Relay C-Female",{"$f":"LEFT($A$13,3)&\"-\"&'CAT; C'!$C$3&\"-06\"","v":"C-F--06"},"",0,0,0]
["Relay C-Female",{"$f":"LEFT($A$13,3)&\"-\"&'CAT; C'!$C$3&\"-07\"","v":"C-F--07"},"",0,0,0]
{"$rows_left_out":61}
{"sheet":"Transfer","index":9,"n_rows":158,"n_cols":26,"rows_kept":158,"cut":false,"hidden":true,"merged":[[1,19,1,20],[1,17,1,18],[1,7,1,8],[1,9,1,10],[1,11,1,12],[1,13,1,14],[1,15,1,16]]}
["Transfer naar sheet 2: Deelnemende brigades"]
[null,"Team-numbers","Team-name","Country","E-mail","Total # athletes","Total # teams","Cat A",null,"Cat B",null,"Cat M",null,"Relay AB",null," Cat C",null,"Cat D",null,"Relay CD",null,"Costs Athl./Teams","Costs\nLunches","Total costs","Payment","Payment date"]
[null,null,null,null,null,null,null,"F","M","F","M","F","M","F","M","F","M","F","M","F","M"]
["Brigade",{"$f":"'CAT; A'!$C$3&\"+\"&'CAT; B'!$C$3&\"+\"&'CAT; M'!$C$3&\"+\"&'CAT; C'!$C$3&\"+\"&'CAT; D'!$C$3","v":"++++"},{"$f":"'CAT; A'!$C$4","v":0},{"$f":"'CAT; A'!$C$5","v":0},{"$f":"'CAT; A'!$C$7","v":0},{"$f":"SUM('Payment info'!$B$4:$B$5)","v":0},{"$f":"SUM('Payment info'!$C$4:$C$5)","v":0},{"$f":"'CAT; A'!$E$21","v":0},{"$f":"'CAT; A'!$E$32","v":0},{"$f":"'CAT; B'!$E$21","v":0},{"$f":"'CAT; B'!$E$32","v":0},{"$f":"'CAT; M'!$E$21","v":0},{"$f":"'CAT; M'!$E$32","v":0},{"$f":"'Relay AB'!D23+'Relay AB'!D52","v":0},{"$f":"'Relay AB'!D36+'Relay AB'!D65","v":0},{"$f":"'CAT; C'!$E$21","v":0},{"$f":"'CAT; C'!$E$32","v":0},{"$f":"'CAT; D'!$E$21","v":0},{"$f":"'CAT; D'!$E$32","v":0},{"$f":"'Relay CD'!D23+'Relay CD'!D52","v":0},{"$f":"'Relay CD'!D36+'Relay CD'!D65","v":0},{"$f":"SUM('Payment info'!D4:D5)","v":0},{"$f":"'Payment info'!D6","v":0},{"$f":"SUM(V4:W4)","v":0}]
[]
[]
["Transfer naar sheet 3ABM: Uitslagen individueel"]
[null,null,null,null,null,{"$f":"'CAT; A'!E11","v":"Number of individual \nstarts"},{"$f":"'CAT; A'!F11","v":"Surf Race"},{"$f":"'CAT; A'!G11","v":"Board Race"},{"$f":"'CAT; A'!H11","v":"Ski race"},{"$f":"'CAT; A'!I11","v":"Ocean(wo)man"},{"$f":"'CAT; A'!J11","v":"2 km City Ocean Run"}]
["Category","Team + nr","Surname","Given name","Year of birth",null,1,2,3,4,5]
["Cat A-Female",{"$f":"IF('CAT; A'!A14=\"\",\"\",'CAT; A'!A14)","v":"-01"},{"$f":"IF('CAT; A'!B14=\"\",\"\",'CAT; A'!B14)","v":""},{"$f":"IF('CAT; A'!C14=\"\",\"\",'CAT; A'!C14)","v":""},{"$f":"IF('CAT; A'!D14=\"\",\"\",'CAT; A'!D14)","v":""},{"$f":"IF('CAT; A'!E14=\"\",\"\",'CAT; A'!E14)","v":0},{"$f":"IF('CAT; A'!F14=\"\",\"\",'CAT; A'!F14)","v":0},{"$f":"IF('CAT; A'!G14=\"\",\"\",'CAT; A'!G14)","v":0},{"$f":"IF('CAT; A'!H14=\"\",\"\",'CAT; A'!H14)","v":0},{"$f":"IF('CAT; A'!I14=\"\",\"\",'CAT; A'!I14)","v":0},{"$f":"IF('CAT; A'!J14=\"\",\"\",'CAT; A'!J14)","v":0}]
["Cat A-Female",{"$f":"IF('CAT; A'!A15=\"\",\"\",'CAT; A'!A15)","v":"-02"},{"$f":"IF('CAT; A'!B15=\"\",\"\",'CAT; A'!B15)","v":""},{"$f":"IF('CAT; A'!C15=\"\",\"\",'CAT; A'!C15)","v":""},{"$f":"IF('CAT; A'!D15=\"\",\"\",'CAT; A'!D15)","v":""},{"$f":"IF('CAT; A'!E15=\"\",\"\",'CAT; A'!E15)","v":0},{"$f":"IF('CAT; A'!F15=\"\",\"\",'CAT; A'!F15)","v":0},{"$f":"IF('CAT; A'!G15=\"\",\"\",'CAT; A'!G15)","v":0},{"$f":"IF('CAT; A'!H15=\"\",\"\",'CAT; A'!H15)","v":0},{"$f":"IF('CAT; A'!I15=\"\",\"\",'CAT; A'!I15)","v":0},{"$f":"IF('CAT; A'!J15=\"\",\"\",'CAT; A'!J15)","v":0}]
["Cat A-Female",{"$f":"IF('CAT; A'!A16=\"\",\"\",'CAT; A'!A16)","v":"-03"},{"$f":"IF('CAT; A'!B16=\"\",\"\",'CAT; A'!B16)","v":""},{"$f":"IF('CAT; A'!C16=\"\",\"\",'CAT; A'!C16)","v":""},{"$f":"IF('CAT; A'!D16=\"\",\"\",'CAT; A'!D16)","v":""},{"$f":"IF('CAT; A'!E16=\"\",\"\",'CAT; A'!E16)","v":0},{"$f":"IF('CAT; A'!F16=\"\",\"\",'CAT; A'!F16)","v":0},{"$f":"IF('CAT; A'!G16=\"\",\"\",'CAT; A'!G16)","v":0},{"$f":"IF('CAT; A'!H16=\"\",\"\",'CAT; A'!H16)","v":0},{"$f":"IF('CAT; A'!I16=\"\",\"\",'CAT; A'!I16)","v":0},{"$f":"IF('CAT; A'!J16=\"\",\"\",'CAT; A'!J16)","v":0}]
["Cat A-Female",{"$f":"IF('CAT; A'!A17=\"\",\"\",'CAT; A'!A17)","v":"-04"},{"$f":"IF('CAT; A'!B17=\"\",\"\",'CAT; A'!B17)","v":""},{"$f":"IF('CAT; A'!C17=\"\",\"\",'CAT; A'!C17)","v":""},{"$f":"IF('CAT; A'!D17=\"\",\"\",'CAT; A'!D17)","v":""},{"$f":"IF('CAT; A'!E17=\"\",\"\",'CAT; A'!E17)","v":0},{"$f":"IF('CAT; A'!F17=\"\",\"\",'CAT; A'!F17)","v":0},{"$f":"IF('CAT; A'!G17=\"\",\"\",'CAT; A'!G17)","v":0},{"$f":"IF('CAT; A'!H17=\"\",\"\",'CAT; A'!H17)","v":0},{"$f":"IF('CAT; A'!I17=\"\",\"\",'CAT; A'!I17)","v":0},{"$f":"IF('CAT; A'!J17=\"\",\"\",'CAT; A'!J17)","v":0}]
["Cat A-Female",{"$f":"IF('CAT; A'!A18=\"\",\"\",'CAT; A'!A18)","v":"-05"},{"$f":"IF('CAT; A'!B18=\"\",\"\",'CAT; A'!B18)","v":""},{"$f":"IF('CAT; A'!C18=\"\",\"\",'CAT; A'!C18)","v":""},{"$f":"IF('CAT; A'!D18=\"\",\"\",'CAT; A'!D18)","v":""},{"$f":"IF('CAT; A'!E18=\"\",\"\",'CAT; A'!E18)","v":0},{"$f":"IF('CAT; A'!F18=\"\",\"\",'CAT; A'!F18)","v":0},{"$f":"IF('CAT; A'!G18=\"\",\"\",'CAT; A'!G18)","v":0},{"$f":"IF('CAT; A'!H18=\"\",\"\",'CAT; A'!H18)","v":0},{"$f":"IF('CAT; A'!I18=\"\",\"\",'CAT; A'!I18)","v":0},{"$f":"IF('CAT; A'!J18=\"\",\"\",'CAT; A'!J18)","v":0}]
["Cat A-Female",{"$f":"IF('CAT; A'!A19=\"\",\"\",'CAT; A'!A19)","v":"-06"},{"$f":"IF('CAT; A'!B19=\"\",\"\",'CAT; A'!B19)","v":""},{"$f":"IF('CAT; A'!C19=\"\",\"\",'CAT; A'!C19)","v":""},{"$f":"IF('CAT; A'!D19=\"\",\"\",'CAT; A'!D19)","v":""},{"$f":"IF('CAT; A'!E19=\"\",\"\",'CAT; A'!E19)","v":0},{"$f":"IF('CAT; A'!F19=\"\",\"\",'CAT; A'!F19)","v":0},{"$f":"IF('CAT; A'!G19=\"\",\"\",'CAT; A'!G19)","v":0},{"$f":"IF('CAT; A'!H19=\"\",\"\",'CAT; A'!H19)","v":0},{"$f":"IF('CAT; A'!I19=\"\",\"\",'CAT; A'!I19)","v":0},{"$f":"IF('CAT; A'!J19=\"\",\"\",'CAT; A'!J19)","v":0}]
[]
["Cat A-Male",{"$f":"IF('CAT; A'!A25=\"\",\"\",'CAT; A'!A25)","v":"-11"},{"$f":"IF('CAT; A'!B25=\"\",\"\",'CAT; A'!B25)","v":""},{"$f":"IF('CAT; A'!C25=\"\",\"\",'CAT; A'!C25)","v":""},{"$f":"IF('CAT; A'!D25=\"\",\"\",'CAT; A'!D25)","v":""},{"$f":"IF('CAT; A'!E25=\"\",\"\",'CAT; A'!E25)","v":0},{"$f":"IF('CAT; A'!F25=\"\",\"\",'CAT; A'!F25)","v":0},{"$f":"IF('CAT; A'!G25=\"\",\"\",'CAT; A'!G25)","v":0},{"$f":"IF('CAT; A'!H25=\"\",\"\",'CAT; A'!H25)","v":0},{"$f":"IF('CAT; A'!I25=\"\",\"\",'CAT; A'!I25)","v":0},{"$f":"IF('CAT; A'!J25=\"\",\"\",'CAT; A'!J25)","v":0}]
["Cat A-Male",{"$f":"IF('CAT; A'!A26=\"\",\"\",'CAT; A'!A26)","v":"-12"},{"$f":"IF('CAT; A'!B26=\"\",\"\",'CAT; A'!B26)","v":""},{"$f":"IF('CAT; A'!C26=\"\",\"\",'CAT; A'!C26)","v":""},{"$f":"IF('CAT; A'!D26=\"\",\"\",'CAT; A'!D26)","v":""},{"$f":"IF('CAT; A'!E26=\"\",\"\",'CAT; A'!E26)","v":0},{"$f":"IF('CAT; A'!F26=\"\",\"\",'CAT; A'!F26)","v":0},{"$f":"IF('CAT; A'!G26=\"\",\"\",'CAT; A'!G26)","v":0},{"$f":"IF('CAT; A'!H26=\"\",\"\",'CAT; A'!H26)","v":0},{"$f":"IF('CAT; A'!I26=\"\",\"\",'CAT; A'!I26)","v":0},{"$f":"IF('CAT; A'!J26=\"\",\"\",'CAT; A'!J26)","v":0}]
["Cat A-Male",{"$f":"IF('CAT; A'!A27=\"\",\"\",'CAT; A'!A27)","v":"-13"},{"$f":"IF('CAT; A'!B27=\"\",\"\",'CAT; A'!B27)","v":""},{"$f":"IF('CAT; A'!C27=\"\",\"\",'CAT; A'!C27)","v":""},{"$f":"IF('CAT; A'!D27=\"\",\"\",'CAT; A'!D27)","v":""},{"$f":"IF('CAT; A'!E27=\"\",\"\",'CAT; A'!E27)","v":0},{"$f":"IF('CAT; A'!F27=\"\",\"\",'CAT; A'!F27)","v":0},{"$f":"IF('CAT; A'!G27=\"\",\"\",'CAT; A'!G27)","v":0},{"$f":"IF('CAT; A'!H27=\"\",\"\",'CAT; A'!H27)","v":0},{"$f":"IF('CAT; A'!I27=\"\",\"\",'CAT; A'!I27)","v":0},{"$f":"IF('CAT; A'!J27=\"\",\"\",'CAT; A'!J27)","v":0}]
["Cat A-Male",{"$f":"IF('CAT; A'!A28=\"\",\"\",'CAT; A'!A28)","v":"-14"},{"$f":"IF('CAT; A'!B28=\"\",\"\",'CAT; A'!B28)","v":""},{"$f":"IF('CAT; A'!C28=\"\",\"\",'CAT; A'!C28)","v":""},{"$f":"IF('CAT; A'!D28=\"\",\"\",'CAT; A'!D28)","v":""},{"$f":"IF('CAT; A'!E28=\"\",\"\",'CAT; A'!E28)","v":0},{"$f":"IF('CAT; A'!F28=\"\",\"\",'CAT; A'!F28)","v":0},{"$f":"IF('CAT; A'!G28=\"\",\"\",'CAT; A'!G28)","v":0},{"$f":"IF('CAT; A'!H28=\"\",\"\",'CAT; A'!H28)","v":0},{"$f":"IF('CAT; A'!I28=\"\",\"\",'CAT; A'!I28)","v":0},{"$f":"IF('CAT; A'!J28=\"\",\"\",'CAT; A'!J28)","v":0}]
{"$rows_left_out":139}
{"sheet":"Parameters","index":10,"n_rows":12,"n_cols":2,"rows_kept":12,"cut":false,"hidden":true,"merged":[]}
["Year:",2024]
["Last entry:","16th of June"]
["Ultimate payment:","20th of June"]
["Cat D Upper",{"$f":"B1-7","v":2017}]
["Cat D Lower",{"$f":"B1-11","v":2013}]
["Cat C Upper",{"$f":"B1-12","v":2012}]
["Cat C Lower",{"$f":"B1-14","v":2010}]
["Cat B Upper",{"$f":"B1-15","v":2009}]
["Cat B Lower",{"$f":"B1-18","v":2006}]
["Cat A Upper",{"$f":"B1-19","v":2005}]
["Cat M Upper",{"$f":"B1-30","v":1994}]
["Limit",{"$f":"B1-100","v":1924}]